RECOMMENDED: If you have Windows errors then we strongly recommend that you download and run this (Windows) Repair Tool.

C1001 Internal Compiler Error Msc1.cpp. An internal error has occurred in the compiler. 1> (compiler file 'msc1.cpp', guess_my_number.cpp 1>c1xx : fatal error C1001: An internal error has occurred. VC6.0的一个编译错误:fatal error C1001: INTERNAL COMPILER. – 2006年3月20日. c:/program files/microsoft visual studio/vc98/include/xlocnum(106) : fatal error C1001: INTERNAL COMPILER ERROR (compiler file 'msc1.cpp', Jun 24, 2013. test.cpp(61) : fatal error C1001: An internal
Error Http 1.1 404 Not Found Atube Catcher Download – UpdateStar – – Download the free trial version below to get started. Double-click the downloaded file to install the software. Ogden Outlaws is an American soccer team based in Ogden, Utah, United States. Founded in 2006, the team plays in the USL Premier Development League (PDL), the fourth tier of the American

Troubleshooting DBCC error 2570 in SQL Server 2005 and later. – Describes an issue where you receive DBCC Error 2570 when you use the DATA_PURITY option in SQL Server 2005 Service Pack 1.

PCIVEN_8086 drivers download for Windows XP,Vista,7 & 8.

MOZA Air 3-Axis Handheld Gimbal Stabilizer+ Controller+. – Details about MOZA Air 3-Axis Handheld Gimbal Stabilizer+ Controller+ Tripod F Mirrorless Came. An error occurred, please try again. Apply Now.

Used PS4 1TB+Controller+ 4 PS4 Games in WV8 Wolverhampton for. – Buy PS4 1TB+Controller+ 4 PS4 Games for GBP 210.00. ERROR. No Image No Image Questions. Liam W.: Swap xbox one s? Spartan S.: Ain't doing.

Use these tips to troubleshoot the error message, "The Server Is Not Operational" in Exchange 2000 or 2003.

Guide: DSDT override eGPU error 12 fix (Windows only) [started. For reference my config is HP 2570p (i5 3360m) – Win 10 x64 + Asus GTX 1060. issues and thought it was because they shared the thunderbolt controller.

Oct 21, 2012  · Could anyone please provide some script or hint how to install files (Windows Updates) on Server 2008 R2? Thanks.

HP Printer: Learn about supplies | Inkjet page yields HP Photosmart 2570 All-in-One series

Oct 24, 2013  · Make sure you are able to access your sysvol and netlogon folder and check the ntfs permission assign on the folder. Run the.

In this research the fuzzy controller is used as a Power System Stabilizer (PSS) to improve the stability in power system. The rule base of the proposed PSS is optimized offline automatically by the improved Genetic Algorithm.

Kohler® Circuit Board Repair for Generator Control Panels

3-Error, The system is unable to decrypt a DTLS record, Standard Recommended. Client may have disassociated with the Controller, No action required. 2570, LWAPP-3-MESH_LINKTEST_INV_ID: "Out of range linktest ID, 3-Error, The.

ESXi and vCenter Server 5.5 Documentation VMware vSphere ESXi and vCenter Server 5.5 Documentation vSphere Installation and Setup Updated Information

Control theory is an interdisciplinary branch of engineering and computational mathematics. The controller C then takes the error e (difference) between the reference and the output to change the inputs u to the system under control P. This is.

Learn about the features of the HP Customer Support site and how to use them to meet your online support needs. Click Here

This enabled development of GENI control software on an external (PC based) controller, substantially meeting layer. 2510 Lo (low band covering 2496–2570 MHz), 2510 Mid (mid-band with 2560–2630 MHz) and 2510 Hi (hi-band covering.

This document is for issues in which a specific 'Scanner Failure' message displays on the printer control panel. If a different error message is present, use the.

Jun 27, 2011. Domain Controller (Local Migration State) – DC Type. 1524 CFAD 2570 [ ERROR] Config::AdAttrEditor::ModifyValue Failed to ldap_modify_s().

no. name series dwg; 1: 06dr7180da3670 (eng. no.) 0202j01904: expansion valve a-32 2: 6chl-ht: 3: b&w 6k84ef: plate 80200(11a) 4: burner control panel for aux. boiler.

Hello, I’m trying to use the custom device and I’m getting an error similar to this one. I’m using Veristand 16.0.0 on a PXI8109 controller, and I’m trying to communicate with a PXI-2570 – 40 spdt board. Since there isn’t a binary version of.

RECOMMENDED: Click here to fix Windows errors and improve system performance