Fix Secure Connection Failed|Error code:SEC_ERROR_OCSP_INVALID_SIGNING_CERT in mozilla firefox

RECOMMENDED: If you have Windows errors then we strongly recommend that you download and run this (Windows) Repair Tool.

The TeamViewer Changelogs contain essential changes and fixes to the most current main version of TeamViewer.

tommmmmm: Indeed, there's no 'stable x86-64 OpenOffice.org' yet 😉 Anyway, your compiler version would be most helpful. Also, how much memory do you have on your.

Dec 29, 2008. unxlngi4.pro/misc/s_helloworld.dpcc' '—* TG_SLO.MK *—' ERROR: Error 65280 occurred while making /home/raul/HEAD/ooo-build/build/src680-m65/helloworld/ source. yeow! That sounded like an impressive sounding error! Back to square one, we go back to the solenv/ project and grep for the ERROR:

May 28, 2011. "Host key verification failed" means that the host key of the remote host was changed. Ssh stores the host keys of the remote hosts in ~/.ssh/known_hosts. You can either edit that text file manually and remove the old key (you can see the line number in the error message), or use ssh-keygen -R hostname.

Aug 22, 2012  · SubInACL is a command-line tool that enables administrators to obtain security information about files, registry keys, and services, and transfer this.

Modbus is a serial communications protocol originally published by Modicon (now Schneider Electric) in 1979 for use with its programmable logic controllers (PLCs).

2011年3月4日. ERROR: Error 65280 occurred while making /var/tmp/portage/app-office/ openoffice-3.2.1-r1/work/ooo/build/OOO320_m19/desktop/zipintro rmdir /var/tmp/ portage/app-office/openoffice-3.2.1-r1/temp/yERj5YXC9A make: *** [stamp/build] Error 1 * ERROR: app-office/openoffice-3.2.1-r1 failed: * Build failed.

but it always fails with exit code 65280 and the warning, "Can't init > outfile ' my_outfile'". However, when I run the same command from the > shell everything is fine and the file is written. The destination is > writable by all. There don't seem to be any permissions problems. > What am I missing? The error.

Aug 20, 2008. Permission denied. Tue Aug 19 05:06:00 2008 INFO: Starting Oracle Universal Installer… Tue Aug 19 05:06:00 2008 INFO: No pre-requisite checks found in oraparam.ini, no system pre-requ. Tue Aug 19 05:06:00 2008 ERROR: Error occured invoking OUI in the clone mode. Exiting with error code 65280

ERROR: error 65280 occurred while making./mdds. Dear all, Hi. This is imacat from Taiwan. I tried to build LibreOffice 3.3.0.1 on my Debian Lenny 5.0.6 x86_64, gcc.

ERROR: error 65280 occurred while making sysui/util and helpcontent2/source/auxiliary. Dear all, Hi. This is imacat from Taiwan. I'm running Debian Lenny 5.0.6, gcc 4.

ERROR: error 65280 occurred while making home/<user>/aoo/main/svx/prj. Hello, I have the following error when I build AOO: http://ooo.pastebin.ca/2377453 I'm building.

Talk:Ubuntu Build Instructions. From Apache OpenOffice Wiki. Jump to. Error 65280 occurred while making /home/kostmo/ooo-build/build/ooc680-m2/helpcontent2.

Error The File Mpq Appears To Be Corrupt Diablo 3 How to Fix Corrupted Game Saves on Xbox 360. corrupted game files will be labeled as “Corrupted Content. you receive an error message stating the file has. ERROR:The file ".MPQ" appears to be corrupt. Delete the corrupted file manually: the path to it is shown in the error message, and it is fairly small. Failed

Sep 28, 2011  · Hello all, I installed a SAP system ECC6 EHP4 ready on Linux and Oracle 11gR2. Thecentral instance and the database.

openoffice.org-3: error 65280 occurred while making /home. – openoffice.org-3: error 65280 occurred while making /home/compile/usr/ports/editors/openoff, ice.org-3/work/OOO300_m15/cppunit: From: Igor (izen.

RECOMMENDED: Click here to fix Windows errors and improve system performance