Alexander Pedals - Syntax Error

RECOMMENDED: If you have Windows errors then we strongly recommend that you download and run this (Windows) Repair Tool.

Build failed with "src/elixir.erl:21: syntax error before: ':='" · Issue. – Jul 19, 2017. Compiled src/elixir_def.erl Compiled src/elixir_interpolation.erl src/elixir.erl:21: syntax error before: ':=' src/elixir.erl:14: type struct() undefined ERROR: compile failed while processing /tmp/elixir/lib/elixir: rebar_abort Makefile:69: recipe for target 'erlang' failed make: *** [erlang] Error 1. Include code samples.

. pointer to char > "digestmd5.c", line 812: syntax error before or at: des_key_schedule. directory /usr/local/src/cyrus-sasl-2.1.22 > *** Error code.

Bios Fan Error Message Secars Error 4097 我找到了最终的解决方案。 我看到有人通过修改系统语言解决了这个问题,因此我意识到原因可能和语言有关。 Sinyal EEG mempunyai bentuk yang kompleks, amplitudo kecil, mudah tertimbun noise dan tidak mempunyai pola yang baku, sehingga analisis secara visual. format(.txt) dan menghasilkan 4097 titik sinyal dari setiap satu perekaman. A BP menghasilkan jumlah iterasi lebih efisien dalam mencapai error minimum. Source: AdsmClientService; Type: Information: Description: The description for

Sep 30, 2008. The first error message says " parse error before 'char' ". What is the code that precedes char? Is it a function declaration? Does it include any user-defined types or anything of the sort? The most likely source of this error is that something shortly above line 44 uses a type or macro that's declared in a.

But before that comment, Trump spoke in awe about a topic he admitted. At.

But before you try them. you don’t only get a complete syntax highlighting, but also a code completion. You might consider this a toy, but it serves an.

This update makes it possible to draft and schedule changes in the Customizer,

digestmd5.c:812: error: syntax error before "des_key_schedule" digestmd5.c:812: warning: no semicolon at end of struct or union digestmd5.c:813: warning: type defaults to `int' in declaration of `ivec' digestmd5.c:813: warning: data definition has no type or storage class digestmd5.c:814: error: syntax error.

Run-time Error ‘0 Number. Severity Level, Number, and Message Text; Condition Symbol and Explanation. 1 1. severe (1): Not a Fortran-specific error. FOR$IOS_NOTFORSPE. An error in the. Runtime Error 0 is an indication that there is a problem with a particular software or the files the program is using to operate. This error shows up when. Nov 26,

And if your computer goes to sleep before your design changes have been saved. WordPress 4.9 introduces Error Highlighting and Syntax checking, both of.

Jun 27, 2009. checking command to parse /usr/bin/nm -B output. ok checking how to hardcode library paths into programs. immediate checking for. digestmd5.c:812: error: expected specifier-qualifier-list before 'des_key_schedule' digestmd5.c: In function 'dec_3des': digestmd5.c:849: warning: implicit declaration of.

then manually identify the file’s final location and specify the command with the.

sql server – Incorrect syntax near ',' – Stack Overflow – I get the following error from the SQL Script I am trying to run: Msg 102, Level 15, State 1, Line 10 Incorrect syntax near ','. This is the SQL script: IF NOT.

digestmd5.c:812: error: syntax error before "des_key_schedule". エラーの内容からするに、des_key_schedule という構造体が定義されているが、

Definement syntax also has the property. In gcc you get a nice clean error message from trying to compile the definement: foo.c: In function ‘foo’: foo.c:3:5: error: expected expression before ‘=’ token x := i ^ This makes it a.

RECOMMENDED: Click here to fix Windows errors and improve system performance