SOLUCIÓN | Errores de cydia iOS 10.2 | DPKG_LOCKED | (2: No such file or directory)

RECOMMENDED: If you have Windows errors then we strongly recommend that you download and run this (Windows) Repair Tool.

Mountain Lion rvm install 1.8.7 x11 error. 3. X11/Xlib.h: No such file or directory in Windows 8. 0. Linking g++ OS X Mavericks. 1. Get full compilation command.

Canon Copier Error Code E001 SOLVED: Show massage on display " E100-0001" – Canon Printer. – canon image class mf 4412 printer error 201-0001 turn of the main power. and the same problem canon image class mf 4750 error 101-0001 turn of the main power how to solved the printers problem i will request the problem solved. Was this answer
Samsung Dryer Error Code He Mar 8, 2016. If your Samsung front load or top load washer is displaying the error fault codes 4E or NF, it is important to find out what is going on with your washer. Generally. These troubleshooting steps apply to all types of Samsung washing machines including front load, top load, and washer & dryer

X11/Xlib.h: No such file or directory. for tk worked fine ,I am facing problem while using make.I am getting this error. X11/Xlib.h: No such file or directory.

During my walks, I noticed that the canyon was being trashed; how sad to do that to such a beautiful place. I might not be aware of the local charm of these cars since no effort has been made to remove them from the canyon — even.

(Again, the beauty of SPU is that no one can observe, firsthand. From there, he moved on to the other forms we’d need for a file, such as written retainer agreements, medical authorization forms, and releases that allow you to get.

For Odroid XU4 "-qt-xcb" option in configure flashing error **X11/Xlib.h: No such file or directory**

test.cpp:1:22: fatal error: X11/Xlib.h: No such file or directory compilation terminated. you need to install X11 development libraries.

error while trying to install program: "X11/Xlib.h: No such. – When I type 'make all' I get this error message: X11/Xlib.h: No such file or directory along with a short list of parse errors, undeclared variables,

libstdc++ Frequently Asked Questions – For the time being, this feature is not used when building the library./a.out: error while loading shared libraries: libstdc++.so.6: cannot open shared object file: No such file or directory /usr/libexec/ld-elf.so.1: Shared object.

Hi, I am trying to compile the code. I am getting this following error. Am I missing any package? x86_screen.h:12:22: error: X11/Xlib.h: No such file

Scandisk Memory Card Error After Canon confirmed an error last week that corrupts the last few images on SanDisk CFast cards with the 1DX Mark II, Nikon has now released a firmware update correcting a glitch that creates read errors on UHS-II SD cards in the D500. Psapi.dll Runtime Error 48 Error 544 Email What are those error numbers

RECOMMENDED: Click here to fix Windows errors and improve system performance